{"text_format":"1","workbook":"xlsx","n_sheets":9,"sheets":["PP","Tekening","BOM","Partlist","Tables","Opbouw","MaxiCompact","Calculatie","Translations"],"not_rendered":{"charts":0,"images":12,"macros":1,"external_links":0,"defined_names":94,"comments":0,"pivot_tables":0},"unopened":[],"bounds":{"document_bytes":16777216,"sheet_cells":100000,"rows_first":2000,"rows_last":500,"rows_between":2000,"halvings":0,"cell_chars":16384,"cell_head_chars":4096},"cells_cut":0,"cells_raw":0,"read":"whole","date_system":"1900"}

{"sheet":"PP","index":0,"n_rows":61,"n_cols":7,"rows_kept":61,"cut":false,"hidden":false,"merged":[[2,1,2,2],[57,4,60,5]]}
[]
[]
[null,"Power Pack"]
[]
[]
[]
[]
[]
[null,null,null,null,null,"v2019.1 CE"]
[]
[null,{"$f":"TextPerLanguage(SEL_LANGUAGE,2)","v":"Bedrijfsnaam:"},null,null,{"$f":"TextPerLanguage(SEL_LANGUAGE,5)","v":"Artikel:"}]
[null,{"$f":"TextPerLanguage(SEL_LANGUAGE,3)","v":"Contactpersoon:"},null,null,{"$f":"TextPerLanguage(SEL_LANGUAGE,20)","v":"Aantal units:"},1]
[null,{"$f":"TextPerLanguage(SEL_LANGUAGE,34)","v":"Referentie:"},null,null,null,null,{"$f":"IF(LEFT(C14,1)=\"N\",1,IF(LEFT(C14,1)=\"D\",3,IF(LEFT(C14,1)=\"F\",4,2)))","v":1}]
[null,{"$f":"TextPerLanguage(SEL_LANGUAGE,1)","v":"Taal:"},"Nederlands"]
[]
[null,null,null,null,null,{"$f":"TODAY()","v":"2019-03-13"}]
[]
[]
[]
[null,{"$f":"TextPerLanguage(SEL_LANGUAGE,7)","v":"Tank:"},"3 : 30 liter aluminium tank",null,{"$f":"TextPerLanguage(SEL_LANGUAGE,12)","v":"Max. werkdruk:"},{"$f":"TEXT(SYS_CLC_MAX_WP,\"0\")&\" bar\"","v":"250 bar"}]
{"$rows_left_out":42}
{"sheet":"Tekening","index":1,"n_rows":42,"n_cols":255,"rows_kept":42,"cut":false,"hidden":false,"merged":[[35,2,37,3]]}
[null,null,null,null,null,null,null,null,null,null,null,null,null,null,null,null,null,null,null,null,null,null,null,null,null,null,null,null,null,null,null,null,null,null,null,null,null,null,null,null,null,null,null,null,null,null,null,null,null,null,null,null,null,null,null,null,null,null,null,null,null,null,null,null,null,null,null,null,null,null,null,null,null,null,null,null,null,null,null,null,null,null,null,null,null,null,null,null,null,null,null,null,null,null,null,null,null,null,null,null,null,null,null,null,null,null,null,null,null,null,null,null,null,null,null,null,null,null,null,null,null,null,null,null,null,null,null,null,null,null,null,null,null,null,null,null,null,null,null,null,null,null,null,null,null,null,null,null,null,null,null,null,null,null,null,null,null,null,null,null,null,null,null,null,null,null,null,null,null,null,null,null,null,null,null,null,null,null,null,null,null,null,null,null,null,null,null,null,null,null,null,null,null,null,null,null,null,null,null,null,null,null,null,null,null,null,null,null,null,null,null,null,null,null,null,null,null,null,null,null,null,null,null,null,null,null,null,null,null,null,null,null,null,null,null,null,null,null,null,null,null,null,null,null,null,null,null,null,null,null,null,null,null,null,"Shapes"]
[]
[]
[]
[]
[]
[]
[]
[]
[]
[]
[]
[]
[]
[]
[]
[]
[]
[]
[]
{"$rows_left_out":23}
{"sheet":"BOM","index":2,"n_rows":90,"n_cols":10,"rows_kept":90,"cut":false,"hidden":true,"merged":[[2,2,2,3],[89,2,89,4]]}
[null,null,"Power-Pack",null,{"$f":"PP!F9","v":"v2019.1 CE"}]
[]
[null,null,{"$f":"T(SEL_PARTNO)","v":""}]
[]
[null,null,{"$f":"TextPerLanguage(SEL_LANGUAGE,157)","v":"Stuklijst"}]
[]
["Opmerking","Cond.",{"$f":"\" \"&TextPerLanguage(SEL_LANGUAGE,221)","v":" Materiaal"},{"$f":"\" \"&TextPerLanguage(SEL_LANGUAGE,186)","v":" Omschrijving"},{"$f":"TextPerLanguage(SEL_LANGUAGE,158)&\" \"","v":"Aantal "},null,"Eenheid","Magazijn","Hoogte","Stekkers"]
["Basis",null,{"$f":"CONCATENATE(\"PP\",LEFT(SEL_TANK,1),LEFT(SEL_PUMP,1),LEFT(SEL_MOTOR,1))&\"HF\"","v":"PP3P1HF"},{"$f":"IF(LEFT(C8,1)=\"-\",\"\",VLOOKUP(C8,DBS_PARTLIST,5,FALSE))","v":"PowerPack 30L, 1cc, 2.2 kW"},1,null,{"$f":"VLOOKUP($C8,DBS_PARTLIST,6,0)","v":""},{"$f":"VLOOKUP($C8,DBS_PARTLIST,7,0)","v":""}]
["Cartridge-blok",null,{"$f":"IF(LEFT(SEL_MOUNTING,2)=\"MC\",\"CARTK043401\",IF(SEL_MOUNT_COUNT=0,IF(LEFT(SEL_RONDPOMP,1)=\"A\",\"CARTK054301\",\"CARTS011201\"),IF(SEL_MOUNT_COUNT=1,IF(LEFT(SEL_RONDPOMP,1)=\"A\",\"CARTK054302\",\"CARTS011201\"),\"CARTS011201\")))","v":"CARTK054301"},"Basisblok P-T",1,null,"EA",300]
["Nippel",{"$f":"LEFT(SEL_MOUNTING,2)=\"MC\"","v":false},{"$f":"IF(B10,\"EGESD18LR34WD\",\"EGESD18LR12WD\")","v":"EGESD18LR12WD"},"Inschroefkoppeling EGES 18 LR 1/2 BSP",1,null,"EA",300]
["Keuze Tank/Peilglas",{"$f":"NOT(OR(B12,B13))","v":true},{"$f":"IF(B11,VLOOKUP(SEL_TANK,DBS_TANK,3,FALSE),\"-\")","v":"LVA1SA"},"Peilglas",1,null,"EA",300]
["Keuze Tank/Peilglas/Temperatuur",{"$f":"SEL_BLN_TEMP","v":false},{"$f":"IF(B12,VLOOKUP(SEL_TANK,DBS_TANK,4,FALSE),\"-\")","v":"-"},"",1,null,"",""]
["Keuze Tank/Peilglas/Temperatuur/Schakelaar",{"$f":"SEL_BLN_TEMP_W_SWITCH","v":false},{"$f":"IF(B13,VLOOKUP(SEL_TANK,DBS_TANK,5,FALSE),\"-\")","v":"-"},"",1,null,"",""]
["Keuze Veiligheid",null,{"$f":"IF(LEFT(SEL_MOUNTING,2)=\"MC\",\"-\",VLOOKUP(SEL_RELIEF_VALVE,DBS_RELIEF_VALVE,2,FALSE))","v":"MO432"},"Drukregelklep patroon",1,null,"EA",300]
["Keuze Pomp - Artikel1 (koppeling)",null,{"$f":"IF(SEL_MOUNT_COUNT=0,\"-\",VLOOKUP(SEL_PUMP,DBS_PUMP,3,FALSE))","v":"-"},"",{"$f":"SEL_MOUNT_COUNT*2","v":0},null,"",""]
["Keuze Pomp - Artikel2 (afsluitdop)",null,{"$f":"IF(SEL_MOUNT_COUNT=0,\"-\",VLOOKUP(SEL_PUMP,DBS_PUMP,4,FALSE))","v":"-"},"",{"$f":"SEL_MOUNT_COUNT*2","v":0},null,"",""]
["Keuze Manometer - Manometer",null,{"$f":"IF(LEFT(SEL_GAUGE,1)=\"<\",\"-\",VLOOKUP(SEL_GAUGE,DBS_GAUGE,2,0))","v":"-"},"",1,null,"",""]
["Keuze Manometer - Afsluiter",null,{"$f":"IF(LEFT(SEL_GAUGE,1)=\"<\",\"-\",VLOOKUP(SEL_GAUGE,DBS_GAUGE,3,0))","v":"-"},"",1,null,"",""]
["Keuze Manometer - Verloopnippel",null,{"$f":"IF(AND(MID(SEL_GAUGE,1,1)<>\"<\",SEL_MOUNT_COUNT>1),\"REDR1214WD\",\"-\")","v":"-"},"",1,null,"",""]
["Stekker SP666",null,{"$f":"IF(E20=0,\"-\",\"SP666\")","v":"-"},"",{"$f":"J90","v":0},null,"",""]
{"$rows_left_out":71}
{"sheet":"Partlist","index":3,"n_rows":266,"n_cols":12,"rows_kept":266,"cut":false,"hidden":true,"merged":[]}
["Artikel","Image","Inb.Hoogte","SP666","Oms","UOM","STOCKNO","ORIGIN","OMS_DUT","OMS_ENG","OMS_GER","OMS_FRE"]
["-",null,null,null,null,"",""]
["933820",null,null,null,{"$f":"CHOOSE(SEL_LANGUAGE,I3,J3,K3,L3)","v":"Tapbout M8x20 -8.8 DIN 933"},"EA",300,null,"Tapbout M8x20 -8.8 DIN 933","Screw M8x20 / 933","Schraube verz. M8x20 8.8","Visse M8x20  8,8"]
["CARTK043401",null,null,null,"MaxiCompact-blok aluminium","EA",300,null,"MaxiCompact-blok aluminium","MaxiCompact-block aluminium","MaxiCompact-block aluminium","block aluminium MaxiCompact"]
["CARTK054301",null,null,null,"Basisblok P-T","EA",300,null,"Basisblok P-T","Baseblock P-T","Basisblock P-T","Embase P-T"]
["CARTK054302",null,null,null,"Basisblok 1 Cetop 3","EA",300,null,"Basisblok 1 Cetop 3","Baseblock 1 Cetop 3","Basisblock 1 Cetop 3","Embase 1 Cetop 3"]
["CARTS011201",null,null,null,"Modulair basisblok","EA",300,null,"Modulair basisblok","Modular baseblock","Modulär Basisblock","Embase modulaire"]
["CB10HVM03009","CB10HVM03009",50,null,"Balanceerklep NG6","EA",300,null,"Balanceerklep NG6","Counterbalance valve","Gegenhalteventil","Valve d'équilibrage NG6"]
["CB10HVM03017","CB10HVM03017",50,null,"Balanceerklep NG6","EA",300,null,"Balanceerklep NG6","Counterbalance valve","Gegenhalteventil","Valve d'équilibrage NG6"]
["CP3002M03001","CP3002M03001",50,null,"Drukcomp. 2-weg CP300-2-B-A-310-7-E NG6","EA",300,null,"Drukcomp. 2-weg CP300-2-B-A-310-7-E NG6","Pressure compensator 2-way","Druckkompensator 2-Wege","Vanne 2-voie pression comp. 2-weg CP300-2-B-A-310-7-E NG6"]
["CP3102M03001","CP3102M03001",50,null,"3weg stroomregelklep CP310-2-B-A-E NG6","EA",300,null,"3weg stroomregelklep CP310-2-B-A-E NG6","3-way flow control valve","3Wege Stromregelventil","Vanne 3-voie presison comp. CP310-2-B-A-E NG6"]
["CP6181B0R",null,null,null,"Afsluiter/Smoring patroon","EA",300,null,"Afsluiter/Smoring patroon","Afsluiter/Smoring patroon","Drosselventilpatrone","Cartouche Robinet/Entrangleur"]
["CP93102B0",null,null,null,"Cavity plug 2-weg serie 10","EA",300,null,"Cavity plug 2-weg serie 10","Cavity Plug 2-Way serie 10","2-Wege Stopfen Serie 10","Bouchon 2-voie serie 10"]
["CP95012",null,null,null,"Spoel cci CP900-12 DC serie 10,12,16,20","EA",300,null,"Spoel cci CP900-12 DC serie 10,12,16,20","Coil 12V DC","Spule 12V DC","Bobine cci CP900-12 DC serie 10,12,16,20"]
["CP950220",null,null,null,"Spoel cci CP900-220 AC serie 10,12,16,20","EA",300,null,"Spoel cci CP900-220 AC serie 10,12,16,20","Coil 220V AC","Spule 220V AC","Bobine cci CP900-220 AC serie 10,12,16,20"]
["CP95024",null,null,null,"Spoel cci CP900-24 DC serie 10,12,16,20","EA",300,null,"Spoel cci CP900-24 DC serie 10,12,16,20","Coil 24V DC","Spule 24V DC","Bobine cci CP900-24 DC serie 10,12,16,20"]
["CV10NP03B00",null,null,null,"Terugslagklep patroon","EA",300,null,"Terugslagklep patroon","Check-Valve cartridge","Rückschlagventil patrone","Cartouche clapet anti-retour"]
["EGESD18LR12WD",null,null,null,"Inschroefkoppeling EGES 18 LR 1/2 BSP","EA",300,null,"Inschroefkoppeling EGES 18 LR 1/2 BSP","Coupling EGES 18L-1/2 BSP","Verschraubung EGES 18 LR 1/2 BSP","Raccord EGES 18 LR 1/2 BSP"]
["EGESD18LR34WD",null,null,null,"Inschroefkoppeling EGES 18 LR 3/4 BSP","EA",300,null,"Inschroefkoppeling EGES 18 LR 3/4 BSP","Coupling EGES 18L-3/4 BSP","Verschraubung EGES 18 LR 3/4 BSP","Raccord EGES 18 LR 3/4 BSP"]
["EM18090",null,null,null,"Manometer afsluiter EM 180","EA",300,null,"Manometer afsluiter EM 180","Pressure gauge shut-off valve","Manometerabsperrhahn","Robinet de fermeture pour manomètre EM 180"]
{"$rows_left_out":247}
{"sheet":"Tables","index":4,"n_rows":105,"n_cols":11,"rows_kept":105,"cut":false,"hidden":true,"merged":[]}
["LST_TANK & DBS_TANK","Ltr.","Peilglas(1)","Peilglas(2)","Peilglas(3)",null,"Code","Oms_DUT","Oms_ENG","Oms_GER","Oms_FRE"]
[{"$f":"G2&\" : \"&CHOOSE(SEL_LANGUAGE,H2,I2,J2,K2)","v":"3 : 30 liter aluminium tank"},30,"LVA1SA","LVA1TA","LVK10AM121T7",null,3,"30 liter aluminium tank","30 litre alumium tank","30 Liter Aluminium Ölbehalter","Réservoir en Aluminium 30 litres"]
[{"$f":"G3&\" : \"&CHOOSE(SEL_LANGUAGE,H3,I3,J3,K3)","v":"4 : 44 liter aluminium tank"},44,"LVA1SA","LVA1TA","LVK10AM121T7",null,"4","44 liter aluminium tank","44 litre alumium tank","44 Liter Aluminium Ölbehalter","Réservoir en Aluminium 44 litres"]
[{"$f":"G4&\" : \"&CHOOSE(SEL_LANGUAGE,H4,I4,J4,K4)","v":"7 : 70 liter aluminium tank"},70,"LVA2SA","LVA2TA","LVK20AM121T7",null,"7","70 liter aluminium tank","70 litre alumium tank","70 Liter Aluminium Ölbehalter","Réservoir en Aluminium 70 litres"]
[null,null,null,null,null,null,""]
["LST_PUMP & DBS_PUMP","CC","Koppeling","Plug",null,null,"Code","Oms_DUT","Oms_ENG","Oms_GER","Oms_FRE"]
[{"$f":"G7&\" : \"&CHOOSE(SEL_LANGUAGE,H7,I7,J7,K7)","v":"P : 1,0  cc pompgroep 1"},1,"GEV12LR38","VS12LS",null,null,"P","1,0  cc pompgroep 1","1,0  cc pumpgroup 1","1,0  cc Pumpgruppe 1","1,0  cc pompe groupe 1"]
["Q : 2,0  cc pompgroep 1",2,"GEV12LR38","VS12LS",null,null,"Q","2,0  cc pompgroep 1","2,0  cc pumpgroup 1","2,0  cc Pumpgruppe 1","2,0  cc pompe groupe 1"]
["R : 3,1  cc pompgroep 1",3.1,"GEV12LR38","VS12LS",null,null,"R","3,1  cc pompgroep 1","3,1  cc pumpgroup 1","3,1  cc Pumpgruppe 1","3,1  cc pompe groupe 1"]
["S : 4,0  cc pompgroep 1",4,"GEV12LR38","VS12LS",null,null,"S","4,0  cc pompgroep 1","4,0  cc pumpgroup 1","4,0  cc Pumpgruppe 1","4,0  cc pompe groupe 1"]
["A : 4,8  cc pompgroep 2",4.8,"GEV12LR38","VS12LS",null,null,"A","4,8  cc pompgroep 2","4,8  cc pumpgroup 2","4,8  cc Pumpgruppe 2","4,8  cc pompe groupe 2"]
["B : 6,5  cc pompgroep 2",6.5,"GEV12LR38","VS12LS",null,null,"B","6,5  cc pompgroep 2","6,5  cc pumpgroup 2","6,5  cc Pumpgruppe 2","6,5  cc pompe groupe 2"]
["C : 8,3  cc pompgroep 2",8.3000000000000007,"GEV12LR38","VS12LS",null,null,"C","8,3  cc pompgroep 2","8,3  cc pumpgroup 2","8,3  cc Pumpgruppe 2","8,3  cc pompe groupe 2"]
["D : 11,1 cc pompgroep 2",11.1,"GEV12LR38","VS12LS",null,null,"D","11,1 cc pompgroep 2","11,1 cc pumpgroup 2","11,1 cc Pumpgruppe 2","11,1 cc pompe groupe 2"]
["E : 14,4 cc pompgroep 2",14.4,"GEV15LR38","VS15L",null,null,"E","14,4 cc pompgroep 2","14,4 cc pumpgroup 2","14,4 cc Pumpgruppe 2","14,4 cc pompe groupe 2"]
["F : 16,6 cc pompgroep 2",16.600000000000001,"GEV15LR38","VS15L",null,null,"F","16,6 cc pompgroep 2","16,6 cc pumpgroup 2","16,6 cc Pumpgruppe 2","16,6 cc pompe groupe 2"]
["G : 20,8 cc pompgroep 2",20.8,"GEV15LR38","VS15L",null,null,"G","20,8 cc pompgroep 2","20,8 cc pumpgroup 2","20,8 cc Pumpgruppe 2","20,8 cc pompe groupe 2"]
["H : 26,0 cc pompgroep 2",26,"GEV15LR38","VS15L",null,null,"H","26,0 cc pompgroep 2","26,0 cc pumpgroup 2","26,0 cc Pumpgruppe 2","26,0 cc pompe groupe 2"]
[null,null,null,null,null,null,""]
["LST_MOTOR & DBS_MOTOR","kW","Omw./Min",null,null,null,"Code","Oms_DUT","Oms_ENG","Oms_GER","Oms_FRE"]
{"$rows_left_out":86}
{"sheet":"Opbouw","index":5,"n_rows":65,"n_cols":10,"rows_kept":65,"cut":false,"hidden":true,"merged":[]}
["Key","Rondpomp","Voltage","Voetplaat","Artikel1","Aantal","Artikel2","Aantal","Artikel3","Aantal"]
[{"$f":"B2&C2&D2","v":"A0"},"A",null,0,"-",null,"-",null,"-"]
["A1","A",null,1,"-",null,"-",null,"-"]
["A2","A",null,2,"CP93102B0",1,"-",null,"MR32GZ",1]
["A3","A",null,3,"CP93102B0",1,"-",null,"MR33GZ",1]
["A4","A",null,4,"CP93102B0",1,"-",null,"MR34GZ",1]
["A5","A",null,5,"CP93102B0",1,"-",null,"MR35GZ",1]
["A6","A",null,6,"CP93102B0",1,"-",null,"MR36GZ",1]
["A7","A",null,7,"CP93102B0",1,"-",null,"MR37GZ",1]
["A8","A",null,8,"CP93102B0",1,"-",null,"MR38GZ",1]
["AMC","A",null,"MC","-",null,"-",null,"-"]
["B012C0","B","012C",0,"SVP10NO00B00",1,"SD9M1612D26WDN",1,"-"]
["B012C1","B","012C",1,"SVP10NO00B00",1,"SD9M1612D26WDN",1,"MR31GZ"]
["B012C2","B","012C",2,"SVP10NO00B00",1,"SD9M1612D26WDN",1,"MR32GZ",1]
["B012C3","B","012C",3,"SVP10NO00B00",1,"SD9M1612D26WDN",1,"MR33GZ",1]
["B012C4","B","012C",4,"SVP10NO00B00",1,"SD9M1612D26WDN",1,"MR34GZ",1]
["B012C5","B","012C",5,"SVP10NO00B00",1,"SD9M1612D26WDN",1,"MR35GZ",1]
["B012C6","B","012C",6,"SVP10NO00B00",1,"SD9M1612D26WDN",1,"MR36GZ",1]
["B012C7","B","012C",7,"SVP10NO00B00",1,"SD9M1612D26WDN",1,"MR37GZ",1]
["B012C8","B","012C",8,"SVP10NO00B00",1,"SD9M1612D26WDN",1,"MR38GZ",1]
{"$rows_left_out":46}
{"sheet":"MaxiCompact","index":6,"n_rows":11,"n_cols":8,"rows_kept":11,"cut":false,"hidden":true,"merged":[]}
["Omschrijving","Image","BOM.Artikel","Aantal","Opmerking","Optie.1","Optie.2","Optie.3"]
["Basis1: Maxicompactblok","-",{"$f":"F2","v":"CARTK043401"},1,"Vaste waarde","CARTK043401"]
["Basis2: Terugslagklep","-",{"$f":"F3","v":"CV10NP03B00"},1,"Vaste waarde","CV10NP03B00"]
["Basis3: Meetpuntkoppeling","-",{"$f":"F4","v":"MEV2014"},null,"Vaste waarde, Aantal berekend in BOM-werkblad","MEV2014"]
["Optie1: Rondpomp","MC12","SVP10NO00B00",1,null,"CP93102B0","SVP10NO00B00"]
["Optie2: Veiligheid","MC21","MO410",1,null,"MO410","MO432"]
["Optie3: Daalklep","MC31",{"$f":"F7","v":"SVP10NC00B00"},1,"Vaste waarde","SVP10NC00B00"]
["Optie4: Volumeregeling","MC41",{"$f":"F8","v":"PU10AAM0B"},1,"Vaste waarde","PU10AAM0B"]
["Optie5: Smoring","MC51","SSM6608",1,null,"SSM6608","SSM6610","SSM6612"]
["Optie6: Noodbediening","MC62","MPPMVENC",1,null,"CP6181B0R","MPPMVENC"]
["Keuz1: Spoel","-","SD9M1612D26WDN",2,null,"SD9M1612D26WDN","SD9M1624D26WDN","CP950220"]

{"sheet":"Calculatie","index":7,"n_rows":31,"n_cols":10,"rows_kept":31,"cut":false,"hidden":true,"merged":[]}
[]
["Tijd-staffel-tabel"]
[]
["E-motor / Secties",0,1,2,3,4,5,6,7,8]
[1,0,10,{"$f":"C5+3","v":13},16,19,22,25,28,31]
[2,0,10,13,16,19,22,25,28,31]
[3,0,10,13,16,19,22,25,28,31]
[4,0,10,13,16,19,22,25,28,31]
[5,30,40,43,46,49,52,55,58,61]
[7,30,40,43,46,49,52,55,58,61]
["Verticaal = Type Elektromotor, Horizontaal = Aantal opbouwsecties"]
[]
["Bepaling montage-tijd"]
[]
["Activiteit","Tijd"]
["Vaste tijd",180]
["Montage PP",{"$f":"VLOOKUP(VALUE(LEFT(SEL_MOTOR,1)),Calculatie!A5:J10,SEL_MOUNT_COUNT+2,FALSE)","v":0}]
["Testen",{"$f":"IF(SEL_BLN_TEST,15,0)","v":15}]
["Spuiten",{"$f":"IF(SEL_MOUNT_COUNT=0,0,(IF(SEL_BLN_PAINT,15,0)))","v":0}]
["Totaal",{"$f":"SUM(B16:B19)","v":195},{"$f":"TEXT((B20-MOD(B20,60))/60,\"#0\")&\":\"&TEXT(MOD(B20,60),\"00\")","v":"3:15"},{"$f":"B20/60","v":3.25}]
{"$rows_left_out":12}
{"sheet":"Translations","index":8,"n_rows":94,"n_cols":6,"rows_kept":94,"cut":false,"hidden":true,"merged":[]}
["ID","Dutch","English","Deutsch","French"]
[1,"Taal:","Language:","Sprache:","Langue:"]
[2,"Bedrijfsnaam:","Company name:","Firma:","Nom de client:"]
[3,"Contactpersoon:","Att.:","Zu Händen:","à l'att.de:"]
[4,"Netto Marge","Nett Margin","Netto Marge","Marge net"]
[5,"Artikel:","Part:","Artikel:","Article:"]
[6,"Datum:","Date:","Datum:","Date:"]
[7,"Tank:","Oil tank:","Ölbehälter:","Réservoir:"]
[8,"Pomp:","Pump:","Pumpe:","Pompe:"]
[9,"Elektromotor:","Motor:","Motor:","Moteur électrique:"]
[11,"Tekeningnummer:","Drawing number:","Zeichnungsnummer:","Numéro de dessin:"]
[12,"Max. werkdruk:","Max. pressure:","Max. Druck:","Pression max.:"]
[13,"Flow:","Flow:","Förderstrom:","Débit:"]
[18,"Manometer:","Pressure Gauge:","Manometer:","Manomètre:"]
[19,"Voltage opbouw:","Voltage cetop:","Spannung Ventile:","Voltage cetop:"]
[20,"Aantal units:","Number of units:","Anzahl der Einheiten:","Quantité centrales:"]
[22,"Klantspecifiek","Customised","Kundenspezifisch","Spécifiquement pour client"]
[23,"Nettoprijs:","Net price:","Netto-Preis:","Prix net:"]
[24,"Levertijd:","Deliverytime:","Liefertermin:","Délai:"]
[25,"in overleg","to be agreed upon","nach Vereinbarung","à déterminer"]
{"$rows_left_out":74}